{"text_format":"1","workbook":"xlsx","n_sheets":8,"sheets":["Cover","UserInterface","SOIAR","SystemOperator","LiveResults","SavedResults","Annual Inflation","Monthly Inflation"],"not_rendered":{"charts":0,"images":1,"macros":1,"external_links":0,"defined_names":123,"comments":1,"pivot_tables":0},"unopened":[],"bounds":{"document_bytes":16777216,"sheet_cells":100000,"rows_first":2000,"rows_last":500,"rows_between":2000,"halvings":0,"cell_chars":16384,"cell_head_chars":4096},"cells_cut":0,"cells_raw":0,"read":"whole","date_system":"1900"}

{"sheet":"Cover","index":0,"n_rows":28,"n_cols":11,"rows_kept":28,"cut":false,"hidden":false,"merged":[]}
[]
["RIIO-2 Price Control Financial Model (PCFM)"]
[null,"Electricity System Operator"]
[null,null,"Model Version",null,null,null,{"$f":"MID(CELL(\"filename\"),SEARCH(\"[\",CELL(\"filename\"))+1,SEARCH(\"]\",CELL(\"filename\"))-SEARCH(\"[\",CELL(\"filename\"))-1)","v":{"$error":"#VALUE!"}}]
[]
[]
[null,"Model key"]
[]
[null,null,null,null,"Sample",null,"Calculated value",null,"Sample",null,"Information and interface"]
[null,null,null,null,"Sample",null,"Import",null,"Sample",null,"Fixed input value"]
[null,null,null,null,"Sample",null,"Export",null,"Sample",null,"Ofgem annual update input (outturn value)"]
[null,null,null,null,"Sample",null,"Named range",null,"Sample",null,"Ofgem annual update input (forecasted value)"]
[null,null,null,null,"Sample",null,"Formula change in cells to the right",null,"Sample",null,"Other annual update input (outturn value)"]
[null,null,null,null,null,null,null,null,"Sample",null,"Other annual update input (forecasted value)"]
[null,null,null,null,null,null,null,null,"Sample",null,"Input linked from annual update"]
{"$rows_left_out":14}
{"sheet":"UserInterface","index":1,"n_rows":45,"n_cols":7,"rows_kept":45,"cut":false,"hidden":false,"merged":[]}
["User Interface"]
[]
[null,"Model operation"]
[]
[null,null,"PCFM year t"]
[null,null,"Instruction: Use the following drop-down list to identify year t in the model. Year t is identified here by its end date."]
[]
[null,null,null,null,"Year t selection:"]
[]
[null,null,null,null,"Year t selected:",null,{"$f":"INDEX(NumberofYear,m_PCFM_year_t)","v":"2026-03-31"}]
[]
[null,null,"Active company"]
[null,null,"Instruction: Use the following drop-down list to select the active company in the model."]
[]
[null,null,null,null,"Company selection:"]
{"$rows_left_out":31}
{"sheet":"SOIAR","index":2,"n_rows":30,"n_cols":46,"rows_kept":30,"cut":false,"hidden":false,"merged":[]}
["Allowed revenue"]
[null,{"$f":"UserInterface!G17","v":"NGESO"}]
[null,null,null,null,"Parameter","Licence condition","Units","Term","Constant",null,null,null,null,null,null,null,null,null,null,null,null,null,null,null,null,null,null,null,null,null,null,null,null,null,null,null,null,null,null,null,null,"Annual values"]
[null,null,null,null,"PCFM year ending",null,null,null,{"$f":"UserInterface!G10","v":"2026-03-31"},null,"1991-03-31","1992-03-31","1993-03-31","1994-03-31","1995-03-31","1996-03-31","1997-03-31","1998-03-31","1999-03-31","2000-03-31","2001-03-31","2002-03-31","2003-03-31","2004-03-31","2005-03-31","2006-03-31","2007-03-31","2008-03-31","2009-03-31","2010-03-31","2011-03-31","2012-03-31","2013-03-31","2014-03-31","2015-03-31","2016-03-31","2017-03-31","2018-03-31","2019-03-31","2020-03-31","2021-03-31","2022-03-31","2023-03-31","2024-03-31","2025-03-31","2026-03-31"]
[]
[null,"Allowed revenue determination"]
[]
[null,null,"Allowed revenue",null,null,null,null,null,null,null,null,null,null,null,null,null,null,null,null,null,null,null,null,null,null,null,null,null,null,null,null,null,null,null,null,null,null,null,null,null,null,null,{"$f":"IF(AND(INDEX(SavedResults!M$16:M$91,MATCH(\"ESO_Rnominal_\"& YEAR(AQ$4),SavedResults!$G$16:$G$91,0))=\"\",$I$4>=AQ$4),AQ26,INDEX(SavedResults!M$16:M$91,MATCH(\"ESO_Rnominal_\"& YEAR(AQ$4),SavedResults!$G$16:$G$91,0)))","v":338.7489646792294},{"$f":"IF(AND(INDEX(SavedResults!N$16:N$91,MATCH(\"ESO_Rnominal_\"& YEAR(AR$4),SavedResults!$G$16:$G$91,0))=\"\",$I$4>=AR$4),AR26,INDEX(SavedResults!N$16:N$91,MATCH(\"ESO_Rnominal_\"& YEAR(AR$4),SavedResults!$G$16:$G$91,0)))","v":445.83829986545254},{"$f":"IF(AND(INDEX(SavedResults!O$16:O$91,MATCH(\"ESO_Rnominal_\"& YEAR(AS$4),SavedResults!$G$16:$G$91,0))=\"\",$I$4>=AS$4),AS26,INDEX(SavedResults!O$16:O$91,MATCH(\"ESO_Rnominal_\"& YEAR(AS$4),SavedResults!$G$16:$G$91,0)))","v":577.64512606876656},{"$f":"IF(AND(INDEX(SavedResults!P$16:P$91,MATCH(\"ESO_Rnominal_\"& YEAR(AT$4),SavedResults!$G$16:$G$91,0))=\"\",$I$4>=AT$4),AT26,INDEX(SavedResults!P$16:P$91,MATCH(\"ESO_Rnominal_\"& YEAR(AT$4),SavedResults!$G$16:$G$91,0)))","v":537.85995804210472}]
[]
[null,null,null,null,"Calculated revenue (as published)",null,"£m nominal","Rt* x  PIt* / PI2018/19",null,null,null,null,null,null,null,null,null,null,null,null,null,null,null,null,null,null,null,null,null,null,null,null,null,null,null,null,null,null,null,null,null,{"$f":"IF(AND(INDEX(SavedResults!L$16:L$91,MATCH(\"ESO_Rnominal_\"& YEAR(AP$4),SavedResults!$G$16:$G$91,0))=\"\",$I$4>=AP$4),AP26,INDEX(SavedResults!L$16:L$91,MATCH(\"ESO_Rnominal_\"& YEAR(AP$4),SavedResults!$G$16:$G$91,0)))","v":268.57236891588599},{"$f":"IF(AND(INDEX(SavedResults!M$16:M$91,MATCH(\"ESO_Rnominal_\"& YEAR(AQ$4),SavedResults!$G$16:$G$91,0))=\"\",$I$4>=AQ$4),AQ26,INDEX(SavedResults!M$16:M$91,MATCH(\"ESO_Rnominal_\"& YEAR(AQ$4),SavedResults!$G$16:$G$91,0)))","v":338.7489646792294},{"$f":"IF(AND(INDEX(SavedResults!N$16:N$91,MATCH(\"ESO_Rnominal_\"& YEAR(AR$4),SavedResults!$G$16:$G$91,0))=\"\",$I$4>=AR$4),AR26,INDEX(SavedResults!N$16:N$91,MATCH(\"ESO_Rnominal_\"& YEAR(AR$4),SavedResults!$G$16:$G$91,0)))","v":445.83829986545254},{"$f":"IF(AND(INDEX(SavedResults!O$16:O$91,MATCH(\"ESO_Rnominal_\"& YEAR(AS$4),SavedResults!$G$16:$G$91,0))=\"\",$I$4>=AS$4),AS26,INDEX(SavedResults!O$16:O$91,MATCH(\"ESO_Rnominal_\"& YEAR(AS$4),SavedResults!$G$16:$G$91,0)))","v":577.64512606876656},{"$f":"IF(AND(INDEX(SavedResults!P$16:P$91,MATCH(\"ESO_Rnominal_\"& YEAR(AT$4),SavedResults!$G$16:$G$91,0))=\"\",$I$4>=AT$4),AT26,INDEX(SavedResults!P$16:P$91,MATCH(\"ESO_Rnominal_\"& YEAR(AT$4),SavedResults!$G$16:$G$91,0)))","v":537.85995804210472}]
[null,null,null,null,"AIP adjustment term",null,"£m nominal","ADJt*",null,null,null,null,null,null,null,null,null,null,null,null,null,null,null,null,null,null,null,null,null,null,null,null,null,null,null,null,null,null,null,null,null,{"$f":"IF(AND(INDEX(SavedResults!L$16:L$91,MATCH(\"ESO_ADJ_\"& YEAR(AP$4),SavedResults!$G$16:$G$91,0))=\"\",$I$4>=AP$4),AP27,INDEX(SavedResults!L$16:L$91,MATCH(\"ESO_ADJ_\"& YEAR(AP$4),SavedResults!$G$16:$G$91,0)))","v":0},{"$f":"IF(AND(INDEX(SavedResults!M$16:M$91,MATCH(\"ESO_ADJ_\"& YEAR(AQ$4),SavedResults!$G$16:$G$91,0))=\"\",$I$4>=AQ$4),AQ27,INDEX(SavedResults!M$16:M$91,MATCH(\"ESO_ADJ_\"& YEAR(AQ$4),SavedResults!$G$16:$G$91,0)))","v":33.258132440532158},{"$f":"IF(AND(INDEX(SavedResults!N$16:N$91,MATCH(\"ESO_ADJ_\"& YEAR(AR$4),SavedResults!$G$16:$G$91,0))=\"\",$I$4>=AR$4),AR27,INDEX(SavedResults!N$16:N$91,MATCH(\"ESO_ADJ_\"& YEAR(AR$4),SavedResults!$G$16:$G$91,0)))","v":-12.630447612329384},{"$f":"IF(AND(INDEX(SavedResults!O$16:O$91,MATCH(\"ESO_ADJ_\"& YEAR(AS$4),SavedResults!$G$16:$G$91,0))=\"\",$I$4>=AS$4),AS27,INDEX(SavedResults!O$16:O$91,MATCH(\"ESO_ADJ_\"& YEAR(AS$4),SavedResults!$G$16:$G$91,0)))","v":16.498441468929144},{"$f":"IF(AND(INDEX(SavedResults!P$16:P$91,MATCH(\"ESO_ADJ_\"& YEAR(AT$4),SavedResults!$G$16:$G$91,0))=\"\",$I$4>=AT$4),AT27,INDEX(SavedResults!P$16:P$91,MATCH(\"ESO_ADJ_\"& YEAR(AT$4),SavedResults!$G$16:$G$91,0)))","v":-6.5870425241760326}]
[null,null,null,null,"Adjusted revenue (as published)",null,null,"ADJRt*",null,null,null,null,null,null,null,null,null,null,null,null,null,null,null,null,null,null,null,null,null,null,null,null,null,null,null,null,null,null,null,null,null,{"$f":"IF(AND(AP10 = \"\", AP11 = \"\"), AP28, SUM(AP10:AP11))","v":268.57236891588599},{"$f":"IF(AND(AQ10 = \"\", AQ11 = \"\"), AQ28, SUM(AQ10:AQ11))","v":372.00709711976157},{"$f":"IF(AND(AR10 = \"\", AR11 = \"\"), AR28, SUM(AR10:AR11))","v":433.20785225312318},594.14356753769573,531.27291551792871]
[]
[null,null,null,null,"Legacy Allowed Revenue",null,"£m nominal","SOLARt",null,null,null,null,null,null,null,null,null,null,null,null,null,null,null,null,null,null,null,null,null,null,null,null,null,null,null,null,null,null,null,null,null,{"$f":"SystemOperator!AP223","v":14.382737731781694},{"$f":"SystemOperator!AQ223","v":11.621458503272803},{"$f":"SystemOperator!AR223","v":-1.3283671281756462},{"$f":"SystemOperator!AS223","v":1.4777869010218856},{"$f":"SystemOperator!AT223","v":0}]
[null,null,null,null,"Allowed Revenue",null,"£m nominal","SOIARt",null,null,null,null,null,null,null,null,null,null,null,null,null,null,null,null,null,null,null,null,null,null,null,null,null,null,null,null,null,null,null,null,null,{"$f":"SUM(AP12, AP14)","v":282.95510664766766},{"$f":"SUM(AQ12, AQ14)","v":383.62855562303434},{"$f":"SUM(AR12, AR14)","v":431.87948512494751},{"$f":"SUM(AS12, AS14)","v":595.62135443871762},{"$f":"SUM(AT12, AT14)","v":531.27291551792871}]
{"$rows_left_out":16}
{"sheet":"SystemOperator","index":3,"n_rows":749,"n_cols":55,"rows_kept":749,"cut":false,"hidden":false,"merged":[]}
["SystemOperator"]
[null,"NGESO"]
[null,null,null,null,"Parameter","Licence condition","Units","Term","Constant",null,null,null,null,null,null,null,null,null,null,null,null,null,null,null,null,null,null,null,null,null,null,null,null,null,null,null,null,null,null,null,null,"Annual values"]
[null,null,null,null,"PCFM year ending",null,null,null,{"$f":"UserInterface!$G$10","v":"2026-03-31"},null,"1991-03-31","1992-03-31","1993-03-31","1994-03-31","1995-03-31","1996-03-31","1997-03-31","1998-03-31","1999-03-31","2000-03-31","2001-03-31","2002-03-31","2003-03-31","2004-03-31","2005-03-31","2006-03-31","2007-03-31","2008-03-31","2009-03-31","2010-03-31","2011-03-31","2012-03-31","2013-03-31","2014-03-31","2015-03-31","2016-03-31","2017-03-31","2018-03-31","2019-03-31","2020-03-31","2021-03-31","2022-03-31","2023-03-31","2024-03-31","2025-03-31","2026-03-31"]
[]
[null,"Totex allowance"]
[]
[null,null,null,null,"Allowed Capex",null,"£m 18/19 prices",null,null,null,null,null,null,null,null,null,null,null,null,null,null,null,null,null,null,null,null,null,null,null,null,null,null,null,null,null,null,null,null,null,null,95.004799842472536,85.534119998750299,92.444925703838592,91.28893392040365,81.493837093064201]
[null,null,null,null,"Allowed Opex",null,"£m 18/19 prices",null,null,null,null,null,null,null,null,null,null,null,null,null,null,null,null,null,null,null,null,null,null,null,null,null,null,null,null,null,null,null,null,null,null,160.84278361643334,162.68658996072799,167.75447059108666,174.59088904557251,174.65486416549285]
[]
[null,"Actual totex"]
[]
[null,null,null,null,"Actual Capex",null,"£m 18/19 prices","SOANC",null,null,null,null,null,null,null,null,null,null,null,null,null,null,null,null,null,null,null,null,null,null,null,null,"Legacy PCFM 2021",42.30937849303178,45.200391958908845,43.912823720572526,59.168411583612148,63.999927894526039,77.834297072780672,85.354179805932233,85.160787666124747,99.156437899704954,90.075209862728158,113.39750523220256,123.53761525017303,98.40121247679609]
[null,null,null,null,"Actual Opex",null,"£m 18/19 prices","SOACO",null,null,null,null,null,null,null,null,null,null,null,null,null,null,null,null,null,null,null,null,null,null,null,null,"Legacy PCFM 2021",107.65670611280169,104.1566747674061,108.2527925000033,114.55436848449007,122.2893082597286,141.41832212672441,126.6991123351587,118.19152551532254,142.45134540698137,159.14416402334169,187.11377731140144,189.20270421107296,187.56087007122474]
[]
{"$rows_left_out":735}
{"sheet":"LiveResults","index":4,"n_rows":93,"n_cols":18,"rows_kept":93,"cut":false,"hidden":false,"merged":[]}
["Live Results"]
[]
[null,"Live results"]
[null,"Note: This sheet displays the output of the PCFM for the live company in the selected year."]
[null,"As well as displaying output it performs the role of recalling results generated with data at earlier stages from the \"SavedResults\" sheet required for the MOD calculation."]
[]
[]
[null,null,"Values for NGESO"]
[]
[]
[null,null,null,null,null,null,null,null,"Company","Calculated for MOD year ending",null,"File"]
[null,null,null,null,null,null,null,null,{"$f":"UserInterface!G17","v":"NGESO"},{"$f":"UserInterface!G10","v":"2026-03-31"},null,{"$f":"MID(CELL(\"filename\"),SEARCH(\"[\",CELL(\"filename\"))+1,SEARCH(\"]\",CELL(\"filename\"))-SEARCH(\"[\",CELL(\"filename\"))-1)","v":{"$error":"#VALUE!"}}]
[]
[null,null,null,null,null,null,null,null,"PCFM year ending","Unit","Licence term (if applicable)","2022-03-31","2023-03-31","2024-03-31","2025-03-31","2026-03-31","RIIO-2 Total","RIIO-2 average"]
[null,null,null,null,null,null,null,null,"Totex"]
{"$rows_left_out":79}
{"sheet":"SavedResults","index":5,"n_rows":93,"n_cols":18,"rows_kept":93,"cut":false,"hidden":false,"merged":[]}
["Saved Results"]
[]
[null,"Links to saved results"]
[null,"Note: The \"Run_for_one\" and \"RunForAll\" macros save output on the \"LiveResults\" sheet to points on this sheet designated by named ranges. The hyperlinks below lead to the saved output for each company."]
[null,"The \"LiveResults\" sheet recalls values generated in earlier iterations (Final Proposals allowances and recalculated base revenue) from this sheet."]
[null,"For \"LiveResults\" to recall data correctly, there must be an equal number of rows between each named ranges marking the start of each company's section. There must also be sufficient rows to hold the output generated on the \"LiveResults\" sheet."]
[]
[null,null,"Values for NGESO"]
[]
[]
[null,null,null,null,null,null,null,null,"Company","Calculated for MOD year ending",null,"File"]
[null,null,null,null,null,null,null,null,"NGESO","2025-03-31",null,"ESO Full Model C04 - macros maybe.xlsm"]
[]
[null,null,null,null,null,null,null,null,"PCFM year ending","Unit","Licence term (if applicable)","2022-03-31","2023-03-31","2024-03-31","2025-03-31","2026-03-31","RIIO-2 Total","RIIO-2 average"]
[null,null,null,null,null,null,null,null,"Totex"]
{"$rows_left_out":79}
{"sheet":"Annual Inflation","index":6,"n_rows":55,"n_cols":46,"rows_kept":55,"cut":false,"hidden":false,"merged":[]}
["Annual Inflation"]
[]
[null,null,null,null,"Parameter","Licence condition","Units","Term","Constant",null,null,null,null,null,null,null,null,null,null,null,null,null,null,null,null,null,null,null,null,null,null,null,null,"Annual values"]
[null,null,null,null,null,null,null,null,null,null,null,null,null,null,null,null,null,null,null,null,null,"2002-03-31","2003-03-31","2004-03-31","2005-03-31","2006-03-31","2007-03-31","2008-03-31","2009-03-31","2010-03-31","2011-03-31","2012-03-31","2013-03-31","2014-03-31","2015-03-31","2016-03-31","2017-03-31","2018-03-31","2019-03-31","2020-03-31","2021-03-31","2022-03-31","2023-03-31","2024-03-31","2025-03-31","2026-03-31"]
[]
[null,null,null,null,"Calendar year",null,"year",null,null,">",null,null,null,null,null,null,null,null,null,null,null,{"$f":"YEAR(V4)","v":2002},2003,2004,2005,2006,2007,2008,2009,2010,2011,2012,2013,2014,2015,2016,2017,2018,2019,2020,2021,2022,2023,2024,2025,2026]
[]
[null,null,null,null,"Last year of actual data",null,"year",null,{"$f":"YEAR( INDEX('Monthly Inflation'!$A:$A, COUNTIF('Monthly Inflation'!$C:$C, \"<>\")))","v":2024}]
[null,null,null,null,"Last month of actual data",null,"month",null,{"$f":"MONTH( INDEX('Monthly Inflation'!$A:$A, COUNTIF('Monthly Inflation'!$C:$C, \"<>\")))","v":6}]
[]
[null,null,null,null,"First month of financial year",null,"month",null,4]
[null,null,null,null,"First day of financial year",null,"day",null,1]
[]
[null,null,null,null,"RIIO-2 real price base",null,"year ending",null,"2019-03-31"]
[null,null,null,null,"Start of RIIO-2",null,"year ending",null,"2022-03-31"]
{"$rows_left_out":41}
{"sheet":"Monthly Inflation","index":7,"n_rows":325,"n_cols":9,"rows_kept":325,"cut":false,"hidden":false,"merged":[]}
["Year-Month","FYE","CPIH Outturn","RPI Outturn","CPI % forecast","RPI % forecast","CPIH","RPI","Price Index"]
["1999-04-01",{"$f":"IF(MONTH(A2)>=4,YEAR(A2)+1,YEAR(A2))","v":2000},72.599999999999994,165.2,{"$f":"IF($A2<DATE(2018,7,1),\"-\",INDEX('Annual Inflation'!$AM$52:$AT$52, MATCH(YEAR(EOMONTH($A2,6)), 'Annual Inflation'!$AM$6:$AT$6, 0))/100)","v":"-"},{"$f":"IF($A2<DATE(2018,7,1),\"-\",INDEX('Annual Inflation'!$AM$49:$AT$49, MATCH(YEAR(EOMONTH($A2,6)), 'Annual Inflation'!$AM$6:$AT$6, 0))/100)","v":"-"},{"$f":"IF(ISBLANK(C2),G1*((1+E2)^(1/12)),C2)","v":72.599999999999994},{"$f":"IF(ISBLANK(D2),H1*((1+F2)^(1/12)),D2)","v":165.2},{"$f":"IF($A2<DATE(2021,4,1),H2,IF(A2=DATE(2021,4,1),I1*((0.5*G2/G1)+(0.5*H2/H1)),I1*(G2/G1)))","v":165.2}]
["1999-05-01",{"$f":"IF(MONTH(A3)>=4,YEAR(A3)+1,YEAR(A3))","v":2000},72.8,165.6,{"$f":"IF($A3<DATE(2018,7,1),\"-\",INDEX('Annual Inflation'!$AM$52:$AT$52, MATCH(YEAR(EOMONTH($A3,6)), 'Annual Inflation'!$AM$6:$AT$6, 0))/100)","v":"-"},{"$f":"IF($A3<DATE(2018,7,1),\"-\",INDEX('Annual Inflation'!$AM$49:$AT$49, MATCH(YEAR(EOMONTH($A3,6)), 'Annual Inflation'!$AM$6:$AT$6, 0))/100)","v":"-"},{"$f":"IF(ISBLANK(C3),G2*((1+E3)^(1/12)),C3)","v":72.8},{"$f":"IF(ISBLANK(D3),H2*((1+F3)^(1/12)),D3)","v":165.6},{"$f":"IF($A3<DATE(2021,4,1),H3,IF(A3=DATE(2021,4,1),I2*((0.5*G3/G2)+(0.5*H3/H2)),I2*(G3/G2)))","v":165.6}]
["1999-06-01",2000,72.7,165.6,{"$f":"IF($A4<DATE(2018,7,1),\"-\",INDEX('Annual Inflation'!$AM$52:$AT$52, MATCH(YEAR(EOMONTH($A4,6)), 'Annual Inflation'!$AM$6:$AT$6, 0))/100)","v":"-"},{"$f":"IF($A4<DATE(2018,7,1),\"-\",INDEX('Annual Inflation'!$AM$49:$AT$49, MATCH(YEAR(EOMONTH($A4,6)), 'Annual Inflation'!$AM$6:$AT$6, 0))/100)","v":"-"},72.7,165.6,165.6]
["1999-07-01",2000,72.400000000000006,165.1,{"$f":"IF($A5<DATE(2018,7,1),\"-\",INDEX('Annual Inflation'!$AM$52:$AT$52, MATCH(YEAR(EOMONTH($A5,6)), 'Annual Inflation'!$AM$6:$AT$6, 0))/100)","v":"-"},{"$f":"IF($A5<DATE(2018,7,1),\"-\",INDEX('Annual Inflation'!$AM$49:$AT$49, MATCH(YEAR(EOMONTH($A5,6)), 'Annual Inflation'!$AM$6:$AT$6, 0))/100)","v":"-"},72.400000000000006,165.1,165.1]
["1999-08-01",2000,72.599999999999994,165.5,{"$f":"IF($A6<DATE(2018,7,1),\"-\",INDEX('Annual Inflation'!$AM$52:$AT$52, MATCH(YEAR(EOMONTH($A6,6)), 'Annual Inflation'!$AM$6:$AT$6, 0))/100)","v":"-"},{"$f":"IF($A6<DATE(2018,7,1),\"-\",INDEX('Annual Inflation'!$AM$49:$AT$49, MATCH(YEAR(EOMONTH($A6,6)), 'Annual Inflation'!$AM$6:$AT$6, 0))/100)","v":"-"},72.599999999999994,165.5,165.5]
["1999-09-01",2000,72.8,166.2,{"$f":"IF($A7<DATE(2018,7,1),\"-\",INDEX('Annual Inflation'!$AM$52:$AT$52, MATCH(YEAR(EOMONTH($A7,6)), 'Annual Inflation'!$AM$6:$AT$6, 0))/100)","v":"-"},{"$f":"IF($A7<DATE(2018,7,1),\"-\",INDEX('Annual Inflation'!$AM$49:$AT$49, MATCH(YEAR(EOMONTH($A7,6)), 'Annual Inflation'!$AM$6:$AT$6, 0))/100)","v":"-"},72.8,166.2,166.2]
["1999-10-01",2000,72.8,166.5,{"$f":"IF($A8<DATE(2018,7,1),\"-\",INDEX('Annual Inflation'!$AM$52:$AT$52, MATCH(YEAR(EOMONTH($A8,6)), 'Annual Inflation'!$AM$6:$AT$6, 0))/100)","v":"-"},{"$f":"IF($A8<DATE(2018,7,1),\"-\",INDEX('Annual Inflation'!$AM$49:$AT$49, MATCH(YEAR(EOMONTH($A8,6)), 'Annual Inflation'!$AM$6:$AT$6, 0))/100)","v":"-"},72.8,166.5,166.5]
["1999-11-01",2000,72.900000000000006,166.7,{"$f":"IF($A9<DATE(2018,7,1),\"-\",INDEX('Annual Inflation'!$AM$52:$AT$52, MATCH(YEAR(EOMONTH($A9,6)), 'Annual Inflation'!$AM$6:$AT$6, 0))/100)","v":"-"},{"$f":"IF($A9<DATE(2018,7,1),\"-\",INDEX('Annual Inflation'!$AM$49:$AT$49, MATCH(YEAR(EOMONTH($A9,6)), 'Annual Inflation'!$AM$6:$AT$6, 0))/100)","v":"-"},72.900000000000006,166.7,166.7]
["1999-12-01",2000,73.099999999999994,167.3,{"$f":"IF($A10<DATE(2018,7,1),\"-\",INDEX('Annual Inflation'!$AM$52:$AT$52, MATCH(YEAR(EOMONTH($A10,6)), 'Annual Inflation'!$AM$6:$AT$6, 0))/100)","v":"-"},{"$f":"IF($A10<DATE(2018,7,1),\"-\",INDEX('Annual Inflation'!$AM$49:$AT$49, MATCH(YEAR(EOMONTH($A10,6)), 'Annual Inflation'!$AM$6:$AT$6, 0))/100)","v":"-"},73.099999999999994,167.3,167.3]
["2000-01-01",2000,72.599999999999994,166.6,{"$f":"IF($A11<DATE(2018,7,1),\"-\",INDEX('Annual Inflation'!$AM$52:$AT$52, MATCH(YEAR(EOMONTH($A11,6)), 'Annual Inflation'!$AM$6:$AT$6, 0))/100)","v":"-"},{"$f":"IF($A11<DATE(2018,7,1),\"-\",INDEX('Annual Inflation'!$AM$49:$AT$49, MATCH(YEAR(EOMONTH($A11,6)), 'Annual Inflation'!$AM$6:$AT$6, 0))/100)","v":"-"},72.599999999999994,166.6,166.6]
["2000-02-01",2000,72.8,167.5,{"$f":"IF($A12<DATE(2018,7,1),\"-\",INDEX('Annual Inflation'!$AM$52:$AT$52, MATCH(YEAR(EOMONTH($A12,6)), 'Annual Inflation'!$AM$6:$AT$6, 0))/100)","v":"-"},{"$f":"IF($A12<DATE(2018,7,1),\"-\",INDEX('Annual Inflation'!$AM$49:$AT$49, MATCH(YEAR(EOMONTH($A12,6)), 'Annual Inflation'!$AM$6:$AT$6, 0))/100)","v":"-"},72.8,167.5,167.5]
["2000-03-01",2000,73,168.4,{"$f":"IF($A13<DATE(2018,7,1),\"-\",INDEX('Annual Inflation'!$AM$52:$AT$52, MATCH(YEAR(EOMONTH($A13,6)), 'Annual Inflation'!$AM$6:$AT$6, 0))/100)","v":"-"},{"$f":"IF($A13<DATE(2018,7,1),\"-\",INDEX('Annual Inflation'!$AM$49:$AT$49, MATCH(YEAR(EOMONTH($A13,6)), 'Annual Inflation'!$AM$6:$AT$6, 0))/100)","v":"-"},73,168.4,168.4]
["2000-04-01",2001,73.3,170.1,{"$f":"IF($A14<DATE(2018,7,1),\"-\",INDEX('Annual Inflation'!$AM$52:$AT$52, MATCH(YEAR(EOMONTH($A14,6)), 'Annual Inflation'!$AM$6:$AT$6, 0))/100)","v":"-"},{"$f":"IF($A14<DATE(2018,7,1),\"-\",INDEX('Annual Inflation'!$AM$49:$AT$49, MATCH(YEAR(EOMONTH($A14,6)), 'Annual Inflation'!$AM$6:$AT$6, 0))/100)","v":"-"},73.3,170.1,170.1]
["2000-05-01",2001,73.5,170.7,{"$f":"IF($A15<DATE(2018,7,1),\"-\",INDEX('Annual Inflation'!$AM$52:$AT$52, MATCH(YEAR(EOMONTH($A15,6)), 'Annual Inflation'!$AM$6:$AT$6, 0))/100)","v":"-"},{"$f":"IF($A15<DATE(2018,7,1),\"-\",INDEX('Annual Inflation'!$AM$49:$AT$49, MATCH(YEAR(EOMONTH($A15,6)), 'Annual Inflation'!$AM$6:$AT$6, 0))/100)","v":"-"},73.5,170.7,170.7]
{"$rows_left_out":310}